Target
DNA-dependent protein kinase catalytic subunit
Ligand
BDBM315618
Substrate
Meas. Tech.
Biochemical Assay
IC50
<3±n/a nM
Citation
 Fuchss, TEmde, UBuchstaller, HMederski, W Arylquinazolines US Patent  US11065253 Publication Date 7/20/2021 
Target
Name:
DNA-dependent protein kinase catalytic subunit
Synonyms:
DNA-PK catalytic subunit DNA-dependent protein kinase (DNA-PK) DNA-dependent protein kinase catalytic subunit (DNA-PK) HYRC PRKDC | PRKDC_HUMAN
Type:
Protein
Mol. Mass.:
469114.78
Organism:
Homo sapiens (Human)
Description:
P78527
Residue:
4128
  
Inhibitor
Name:
BDBM315618
Synonyms:
6-{[2-Chloro-4-fluoro-5- (7-morpholin-4-yl- quinazolin-4-yl)phenyl]- hydroxymethyl}-2- methyl-2H-pyridazin-3- one (Ena 2)1H NMR (500 MHz, DMSO-d6) ppm = 9.12 (s, 1H), 7.93 (d, J = 7.7, 1H), 7.68 (d, J = 9.5, 1H), 7.61- 7.52 (m, 2H), 7.48 (d, J = 9.6, 1H), 7.21 (d, J = 2.4, 1H), 6.93 (d, J = 9.6, 1H), 6.60 (d, J = 4.8, 1H), 5.89 (d, J = 4.8, 1H), 3.80-3.75 (m, 4H), 3.59 (s, 3H), 3.48-3.43 (m, 4H) US10172859, Example 45 US11065253, Example 59 | US9732094, Example 59
Type:
Small organic molecule
Emp. Form.:
C24H21ClFN5O3
Mol. Mass.:
481.907
SMILES:
Cn1nc(ccc1=O)C(O)c1cc(c(F)cc1Cl)-c1ncnc2cc(ccc12)N1CCOCC1
: