Target
DNA-dependent protein kinase catalytic subunit
Ligand
BDBM315675
Substrate
Meas. Tech.
Biochemical Assay
IC50
<3±n/a nM
Citation
 Fuchss, TEmde, UBuchstaller, HMederski, W Arylquinazolines US Patent  US11065253 Publication Date 7/20/2021 
Target
Name:
DNA-dependent protein kinase catalytic subunit
Synonyms:
DNA-PK catalytic subunit DNA-dependent protein kinase (DNA-PK) DNA-dependent protein kinase catalytic subunit (DNA-PK) HYRC PRKDC | PRKDC_HUMAN
Type:
Protein
Mol. Mass.:
469114.78
Organism:
Homo sapiens (Human)
Description:
P78527
Residue:
4128
  
Inhibitor
Name:
BDBM315675
Synonyms:
US10172859, Example 100 US9732094, Example 100 | [2-Chloro-4-fluoro-5-(7-morpholin-4-ylquinazolin-4-yl)phenyl]-[6-(oxetan-3-yloxy)pyridazin-3-yl]methanol
Type:
Small organic molecule
Emp. Form.:
C26H23ClFN5O4
Mol. Mass.:
523.943
SMILES:
OC(c1ccc(OC2COC2)nn1)c1cc(c(F)cc1Cl)-c1ncnc2cc(ccc12)N1CCOCC1
: