Target
DNA-dependent protein kinase catalytic subunit
Ligand
BDBM315824
Substrate
Meas. Tech.
Biochemical Assay
IC50
<3±n/a nM
Citation
 Fuchss, TEmde, UBuchstaller, HMederski, W Arylquinazolines US Patent  US11065253 Publication Date 7/20/2021 
Target
Name:
DNA-dependent protein kinase catalytic subunit
Synonyms:
DNA-PK catalytic subunit DNA-dependent protein kinase (DNA-PK) DNA-dependent protein kinase catalytic subunit (DNA-PK) HYRC PRKDC | PRKDC_HUMAN
Type:
Protein
Mol. Mass.:
469114.78
Organism:
Homo sapiens (Human)
Description:
P78527
Residue:
4128
  
Inhibitor
Name:
BDBM315824
Synonyms:
US10172859, Example 245 US10172859, Example 265 US9732094, Example 265 | [4-Fluoro-3-(6- morpholin-4-yl- thieno[3,2-d}- pyrimidin-4-yl)- phenyl]-(3-methyl- pyrazin-2-yl)- methanol (Ena 1)see racemate
Type:
Small organic molecule
Emp. Form.:
C22H20FN5O2S
Mol. Mass.:
437.49
SMILES:
Cc1nccnc1C(O)c1ccc(F)c(c1)-c1ncnc2cc(sc12)N1CCOCC1
: