Target
Ubiquitin carboxyl-terminal hydrolase 30
Ligand
BDBM504675
Substrate
Meas. Tech.
Biochemical Fluorescence Intensity Kinetic Assay
IC50
<100±n/a nM
Citation
 Jones, AKemp, MStockley, MGibson, KWhitlock, G 1-cyano-pyrrolidine compounds as USP30 inhibitors US Patent  US11066365 Publication Date 7/20/2021 
Target
Name:
Ubiquitin carboxyl-terminal hydrolase 30
Synonyms:
Deubiquitinating enzyme 30 USP30 Ubiquitin carboxyl-terminal hydrolase 30 (USP30) Ubiquitin-specific-processing protease 30
Type:
Protein
Mol. Mass.:
58522.90
Organism:
Homo sapiens (Human)
Description:
Q70CQ3
Residue:
517
  
Inhibitor
Name:
BDBM504675
Synonyms:
US11066365, Example 51 rac-(3aR,6aR)-1-([1,1'-biphenyl]- 3-carbonyl)hexahydropyrrolo[3,4- b]pyrrole-5(1H)-carbonitrile
Type:
Small organic molecule
Emp. Form.:
C20H19N3O
Mol. Mass.:
317.3844
SMILES:
O=C(N1CC[C@@H]2CN(C[C@H]12)C#N)c1cccc(c1)-c1ccccc1
: