Target
Ubiquitin carboxyl-terminal hydrolase 30
Ligand
BDBM404532
Substrate
Meas. Tech.
Biochemical Fluorescence Intensity Kinetic Assay
IC50
<100±n/a nM
Citation
 Jones, AKemp, MStockley, MGibson, KWhitlock, G 1-cyano-pyrrolidine compounds as USP30 inhibitors US Patent  US11066365 Publication Date 7/20/2021 
Target
Name:
Ubiquitin carboxyl-terminal hydrolase 30
Synonyms:
Deubiquitinating enzyme 30 USP30 Ubiquitin carboxyl-terminal hydrolase 30 (USP30) Ubiquitin-specific-processing protease 30
Type:
Protein
Mol. Mass.:
58522.90
Organism:
Homo sapiens (Human)
Description:
Q70CQ3
Residue:
517
  
Inhibitor
Name:
BDBM404532
Synonyms:
(R)-N-(1- cyanopyrrolidin- 3-yl)-2-fluoro-4- (2-methyl-3H- pyrrolo[2,3- d]pyrimidin-4- yl)benzamide US10689345, Example 184 | US11066365, Example 184
Type:
Small organic molecule
Emp. Form.:
C19H17FN6O
Mol. Mass.:
364.3763
SMILES:
Cc1nc2nccc2c([nH]1)-c1ccc(C(=O)N[C@@H]2CCN(C2)C#N)c(F)c1
: