Target
Ubiquitin carboxyl-terminal hydrolase 30
Ligand
BDBM404580
Substrate
Meas. Tech.
Biochemical Fluorescence Intensity Kinetic Assay
IC50
<100±n/a nM
Citation
 Jones, AKemp, MStockley, MGibson, KWhitlock, G 1-cyano-pyrrolidine compounds as USP30 inhibitors US Patent  US11066365 Publication Date 7/20/2021 
Target
Name:
Ubiquitin carboxyl-terminal hydrolase 30
Synonyms:
Deubiquitinating enzyme 30 USP30 Ubiquitin carboxyl-terminal hydrolase 30 (USP30) Ubiquitin-specific-processing protease 30
Type:
Protein
Mol. Mass.:
58522.90
Organism:
Homo sapiens (Human)
Description:
Q70CQ3
Residue:
517
  
Inhibitor
Name:
BDBM404580
Synonyms:
(R)-N-(1-cyanopyrrolidin-3-yl)-3-fluoro-1-methyl-5-(1-methyl-1H-pyrazol-4-yl)-1H-indole-2-carboxamide US10689345, Example 232 US11066365, Example 232 | US11390584, Example 232
Type:
Small organic molecule
Emp. Form.:
C19H19FN6O
Mol. Mass.:
366.3922
SMILES:
Cn1cc(cn1)-c1ccc2n(C)c(C(=O)N[C@@H]3CCN(C3)C#N)c(F)c2c1
: