Target
Histone deacetylase 6
Ligand
BDBM504526
Substrate
Meas. Tech.
Enzymatic Assay
IC50
7.20±n/a nM
Citation
 Walji, ABerger, RStump, CASchlegel, KSMulhearn, JJGreshock, TJWang, DFraley, MEJones, KG 3-aryl- heteroaryl substituted 5-trifluoromethyl oxadiazoles as histonedeacetylase 6 (HDAC6) inhibitors US Patent  US11066396 Publication Date 7/20/2021 
Target
Name:
Histone deacetylase 6
Synonyms:
Cereblon/Histone deacetylase 6 HDAC6 Histone deacetylase 6 (HDAC6) KIAA0901 | ORF Names:JM21
Type:
Chromatin regulator; hydrolase; repressor
Mol. Mass.:
131381.51
Organism:
Homo sapiens (Human)
Description:
Q9UBN7
Residue:
1215
  
Inhibitor
Name:
BDBM504526
Synonyms:
US11066396, Example 8 | tert-Butyl(S)-1-(2,5-difluoro-4-(5-(trifluoromethyl)-1,2,4-oxadiazol-3-yl)phenyl)-5-oxopyrrolidine-2-carboxylate
Type:
Small organic molecule
Emp. Form.:
C18H16F5N3O4
Mol. Mass.:
433.3294
SMILES:
CC(C)(C)OC(=O)[C@@H]1CCC(=O)N1c1cc(F)c(cc1F)-c1noc(n1)C(F)(F)F
: