Target
Histone deacetylase 6
Ligand
BDBM505072
Substrate
Meas. Tech.
Enzymatic Assay
IC50
3.40±n/a nM
Citation
 Walji, ABerger, RStump, CASchlegel, KSMulhearn, JJGreshock, TJWang, DFraley, MEJones, KG 3-aryl- heteroaryl substituted 5-trifluoromethyl oxadiazoles as histonedeacetylase 6 (HDAC6) inhibitors US Patent  US11066396 Publication Date 7/20/2021 
Target
Name:
Histone deacetylase 6
Synonyms:
Cereblon/Histone deacetylase 6 HDAC6 Histone deacetylase 6 (HDAC6) KIAA0901 | ORF Names:JM21
Type:
Chromatin regulator; hydrolase; repressor
Mol. Mass.:
131381.51
Organism:
Homo sapiens (Human)
Description:
Q9UBN7
Residue:
1215
  
Inhibitor
Name:
BDBM505072
Synonyms:
1-({5-[5- (trifluoro- methyl)- 1,2,4-oxa- diazol-3- yl]pyridin- 2-yl} methyl)- 1,4-dihydro- quinoxaline- 2,3-dione | US11066396, Example 469
Type:
Small organic molecule
Emp. Form.:
C17H10F3N5O3
Mol. Mass.:
389.2882
SMILES:
FC(F)(F)c1nc(no1)-c1ccc(Cn2c3ccccc3[nH]c(=O)c2=O)nc1
: