Target
Adenosine receptor A2a
Ligand
BDBM505333
Substrate
Meas. Tech.
Binding Affinity Assay
IC50
79.0±n/a nM
Citation
 Wang, YZhang, NWu, T Aminopyrimidine five-membered heterocyclic compound, and intermediate, preparation method, pharmaceutical composition and application thereof US Patent  US11066413 Publication Date 7/20/2021 
Target
Name:
Adenosine receptor A2a
Synonyms:
A2A adenosine receptor (hA2A) ADENOSINE A2 ADORA2 Adenosine A2A receptor (A2AAR)
Type:
G Protein-Coupled Receptor (GPCR)
Mol. Mass.:
44716.46
Organism:
Homo sapiens (Human)
Description:
P29274
Residue:
412
  
Inhibitor
Name:
BDBM505333
Synonyms:
US11066413, Compound 1 | US11066413, Compound 40
Type:
Small organic molecule
Emp. Form.:
C17H12FN3O3
Mol. Mass.:
325.2939
SMILES:
Nc1nc2C(Cc3ccccc3F)OC(=O)c2c(n1)-c1ccco1
: