Target
Adenosine receptor A2a
Ligand
BDBM505369
Substrate
Meas. Tech.
Binding Affinity Assay
IC50
6.10±n/a nM
Citation
 Wang, YZhang, NWu, T Aminopyrimidine five-membered heterocyclic compound, and intermediate, preparation method, pharmaceutical composition and application thereof US Patent  US11066413 Publication Date 7/20/2021 
Target
Name:
Adenosine receptor A2a
Synonyms:
A2A adenosine receptor (hA2A) ADENOSINE A2 ADORA2 Adenosine A2A receptor (A2AAR)
Type:
G Protein-Coupled Receptor (GPCR)
Mol. Mass.:
44716.46
Organism:
Homo sapiens (Human)
Description:
P29274
Residue:
412
  
Inhibitor
Name:
BDBM505369
Synonyms:
US11066413, Compound 38
Type:
Small organic molecule
Emp. Form.:
C18H13FN4O2
Mol. Mass.:
336.3198
SMILES:
CN1C(=O)c2c(nc(N)nc2-c2ccco2)C1=Cc1ccccc1F
: