Target
Adenosine receptor A2a
Ligand
BDBM505357
Substrate
Meas. Tech.
Binding Affinity Assay
IC50
87.4±n/a nM
Citation
 Wang, YZhang, NWu, T Aminopyrimidine five-membered heterocyclic compound, and intermediate, preparation method, pharmaceutical composition and application thereof US Patent  US11066413 Publication Date 7/20/2021 
Target
Name:
Adenosine receptor A2a
Synonyms:
A2A adenosine receptor (hA2A) ADENOSINE A2 ADORA2 Adenosine A2A receptor (A2AAR)
Type:
G Protein-Coupled Receptor (GPCR)
Mol. Mass.:
44716.46
Organism:
Homo sapiens (Human)
Description:
P29274
Residue:
412
  
Inhibitor
Name:
BDBM505357
Synonyms:
US11066413, Compound 26 | US11066413, Compound 42
Type:
Small organic molecule
Emp. Form.:
C18H13F2N3O3
Mol. Mass.:
357.3109
SMILES:
Cc1ccc(o1)-c1nc(N)nc2C(Cc3ccc(F)cc3F)OC(=O)c12
: