Target
Epidermal growth factor receptor
Ligand
BDBM506229
Substrate
Meas. Tech.
High Throughput Biochemical Assay
IC50
1.000±n/a nM
Citation
 Bacon, EMBalan, GChou, CClark, CTCottell, JJKim, MKirschberg, TALink, JOPhillips, GSchroeder, SDSquires, NHStevens, KLTaylor, JGWatkins, WJWright, NEZipfel, SM Cot modulators and methods of use thereof US Patent  US11066414 Publication Date 7/20/2021 
Target
Name:
Epidermal growth factor receptor
Synonyms:
EGF Receptor Substrate EGFR_HUMAN ERBB1 Epidermal Growth Factor Receptor erbB-1 Epidermal growth factor receptor (EGFR) HER1 Proto-oncogene c-ErbB-1 Tyrosine-Protein Kinase ErbB-1
Type:
Receptor Kinase Domain
Mol. Mass.:
134279.59
Organism:
Homo sapiens (Human)
Description:
P00533
Residue:
1210
  
Inhibitor
Name:
BDBM506229
Synonyms:
(S)-6-(((2-methyl-1-oxo-1,2- dihydroisoquinolin- 5-yl)(1-(1-methylcyclopropyl)-1H-1,2,3- triazol-4-yl)methyl)amino)-4- (neopentylamino)quinoline-3,8-dicarbonitrile | US11066414, Compound 879
Type:
Small organic molecule
Emp. Form.:
C33H35N9O
Mol. Mass.:
573.6907
SMILES:
Cn1ccc2c(cccc2c1=O)[C@H](Nc1cc(C#N)c2ncc(C#N)c(NCC(C)(C)C)c2c1)C1=CN(NN1)C1(C)CC1
: