Target
Somatostatin receptor type 4
Ligand
BDBM506608
Substrate
Meas. Tech.
SSTR4 I-125 Somatostatin Competition Binding Assay
IC50
25.1±n/a nM
Citation
 Cheruvallath, ZGreen, JJohnson, BSchleicher, KSun, HTang, M Piperidinyl-3-(aryloxy)propanamides and propanoates US Patent  US11045457 Publication Date 6/29/2021 
Target
Name:
Somatostatin receptor type 4
Synonyms:
SOMATOSTATIN SST4 SS4-R SSR4_HUMAN SSTR4 | Somatostatin receptor type 4 (SSTR4)
Type:
Enzyme
Mol. Mass.:
42015.38
Organism:
Homo sapiens (Human)
Description:
P31391
Residue:
388
  
Inhibitor
Name:
BDBM506608
Synonyms:
US11045457, Example 209
Type:
Small organic molecule
Emp. Form.:
C17H23F2N3O2
Mol. Mass.:
339.3802
SMILES:
C[C@H]1CNCC[C@@H]1NC(=O)C(F)(F)COc1ncccc1C1CC1
: