BDBM101648 US8530504, 9
SMILES CCCN(C1CCOCC1)c1c(OC)nn2c(c(CC)sc12)-c1c(OC)cc(COC)cc1OC
InChI Key InChIKey=XBBROUMVTNSTGZ-UHFFFAOYSA-N
Data  1 IC50
  Tab Delimited (TSV)   2D SDfile   Computed 3D by Vconf -m prep SDfile
Find this compound or compounds like it in BindingDB:
Activity Spreadsheet -- Enzyme Inhibition Constant Data from BindingDB
Found 1 hit for monomerid = 101648
TargetCorticotropin-releasing factor receptor 1(Homo sapiens (Human))
Eisai R&D Management
US Patent
LigandPNGBDBM101648(US8530504, 9)
Affinity DataIC50:  116nM. Assay description: A binding competition experiment with CRF was conducted by the SPA (GE Healthcare) method using a 96-well plate.
In DepthDetails US Patent