BDBM102110 US8530460, 9
SMILES CCC(=O)N[C@@H](C)c1ccc(OC2CN(C2)c2ncc(cn2)C2CC2)cc1
InChI Key InChIKey=OAHPDFDFUSMLNR-AWEZNQCLSA-N
Data  1 IC50
  Tab Delimited (TSV)   2D SDfile   Computed 3D by Vconf -m prep SDfile
Find this compound or compounds like it in BindingDB:
Activity Spreadsheet -- Enzyme Inhibition Constant Data from BindingDB
Found 1 hit for monomerid = 102110
TargetIsoform 3 of Acetyl-CoA carboxylase 2 (ACC2.v2)(Homo sapiens (Human))
Boehringer Ingelheim International
US Patent
LigandPNGBDBM102110(US8530460, 9)
Affinity DataIC50:  1.10E+3nM. Assay description: Enzyme assay using human acetyl-CoA carboxylase 2 (ACC).
In DepthDetails US Patent