BDBM10277 4-Chloro-N-(1,2,3,4-tetrahydro-1,3,4-trioxoisoquinolin-6-yl)-butanamide::4-chloro-N-(1,3,4-trioxo-1,2,3,4-tetrahydroisoquinolin-6-yl)butanamide::Isoquinoline-1,3,4-trione 9j
SMILES ClCCCC(=O)Nc1ccc2C(=O)NC(=O)C(=O)c2c1
InChI Key InChIKey=PETLWZBTOJWCLE-UHFFFAOYSA-N
Data  1 IC50
  Tab Delimited (TSV)   2D SDfile   Computed 3D by Vconf -m prep SDfile
Find this compound or compounds like it in BindingDB:
Activity Spreadsheet -- Enzyme Inhibition Constant Data from BindingDB
Found 1 hit for monomerid = 10277
TargetCaspase-3(Homo sapiens (Human))
Shanghai Institutes For Biological Sciences
LigandPNGBDBM10277(4-Chloro-N-(1,2,3,4-tetrahydro-1,3,4-trioxoisoquin...)
Affinity DataIC50:  140nM. Assay description: The rate of chromogenic substrate hydrolysis was monitored by the change of absorbance at 405 nm for 3 min. Compounds were tested in duplicate. The I...
In DepthDetails ArticlePubMed