BDBM103242 US8541407, 219
SMILES NC1(CCC1)c1ccc(cc1)-c1nnc2-c3cc(Br)ccc3Nc3ncccc3-n12
InChI Key InChIKey=XZNDWUDXBMHLSN-UHFFFAOYSA-N
Data  1 IC50
  Tab Delimited (TSV)   2D SDfile   Computed 3D by Vconf -m prep SDfile
Find this compound or compounds like it in BindingDB:
Activity Spreadsheet -- Enzyme Inhibition Constant Data from BindingDB
Found 1 hit for monomerid = 103242
TargetRAC-alpha serine/threonine-protein kinase(Homo sapiens (Human))
Arqule
US Patent
LigandPNGBDBM103242(US8541407, 219)
Affinity DataIC50:  130nM. Assay description: Biochemical assay using Akt AlphaScreen (Amplified Luminescent Proximity Homogeneous Assay) technology.
In DepthDetails US Patent