BDBM103579 ATX inhibitor 10 analogue 9::ATX inhibitor 9
SMILES OC(=O)CCCN1CCN(CC1)C1=NC(=O)\C(S1)=C\c1ccc(Cl)c(Cl)c1
InChI Key InChIKey=JSMAFJJTYRDMBE-PTNGSMBKSA-N
Data  1 IC50
  Tab Delimited (TSV)   2D SDfile   Computed 3D by Vconf -m prep SDfile
Find this compound or compounds like it in BindingDB:
Activity Spreadsheet -- Enzyme Inhibition Constant Data from BindingDB
Found 1 hit for monomerid = 103579
TargetEctonucleotide pyrophosphatase/phosphodiesterase family member 2(Mus musculus)
The University Of Tokyo
LigandPNGBDBM103579(ATX inhibitor 10 analogue 9 | ATX inhibitor 9)
Affinity DataIC50:  400nM
In DepthDetails ArticlePubMed