BDBM10601 (+)-(3aR)-3a-Methyl-2,3,3a,8a-Tetrahydrofuro[2,3-b]benzofuran-5-yl N-(o-Tolyl)carbamate::(2R)-2-methyl-5,7-dioxatricyclo[6.4.0.0^{2,6}]dodeca-1(12),8,10-trien-11-yl N-(2-methylphenyl)carbamate::Tetrahydrofurobenzofuran Carbamate 9b
SMILES Cc1ccccc1NC(=O)Oc1ccc2OC3OCC[C@]3(C)c2c1
InChI Key InChIKey=JZMKNXICJRCGJX-WHCXFUJUSA-N
Data  2 IC50
  Tab Delimited (TSV)   2D SDfile   Computed 3D by Vconf -m prep SDfile
Find this compound or compounds like it in BindingDB:
Activity Spreadsheet -- Enzyme Inhibition Constant Data from BindingDB
Found 2 hits for monomerid = 10601
TargetCholinesterase(Homo sapiens (Human))
National Institutes Of Health
LigandPNGBDBM10601((+)-(3aR)-3a-Methyl-2,3,3a,8a-Tetrahydrofuro[2,3-b...)
Affinity DataIC50:  3.64E+4nM. Assay description: The cholinesterase assays were performed using colorimetric method reported by Ellman. The absorbance changes at 412 nm were recorded for 5 min with ...
In DepthDetails ArticlePubMed
TargetAcetylcholinesterase(Homo sapiens (Human))
National Institutes Of Health
LigandPNGBDBM10601((+)-(3aR)-3a-Methyl-2,3,3a,8a-Tetrahydrofuro[2,3-b...)
Affinity DataIC50:  36nMpH: 8.0 T: 2°C. Assay description: The cholinesterase assays were performed using colorimetric method reported by Ellman. The absorbance changes at 412 nm were recorded for 5 min with ...
In DepthDetails ArticlePubMed