BDBM10648 2-arylpurine deriv. 13::methyl N-(4-{6-[(2-methoxyethyl)amino]-9-(propan-2-yl)-9H-purin-2-yl}phenyl)carbamate
SMILES COCCNc1nc(nc2n(cnc12)C(C)C)-c1ccc(NC(=O)OC)cc1
InChI Key InChIKey=JXNPVMRAKCYGTB-UHFFFAOYSA-N
Data  3 IC50
  Tab Delimited (TSV)   2D SDfile   Computed 3D by Vconf -m prep SDfile
Find this compound or compounds like it in BindingDB:
Activity Spreadsheet -- Enzyme Inhibition Constant Data from BindingDB
Found 3 hits for monomerid = 10648
TargetCyclin-dependent kinase 1/G2/mitotic-specific cyclin-B(Marthasterias glacialis (starfish))
Institut Curie
LigandPNGBDBM10648(2-arylpurine deriv. 13 | methyl N-(4-{6-[(2-methox...)
Affinity DataIC50:  4.40E+3nMpH: 7.2 T: 2°C. Assay description: Kinase activities were assayed in buffers containing substrate, enzyme, and inhibitor at 30 °C in the presence of 15 uM ATP/[gamma-32P] ATP. 32P...
In DepthDetails ArticlePubMed
TargetGlycogen synthase kinase-3 beta(Rattus norvegicus (rat))
Institut Curie
LigandPNGBDBM10648(2-arylpurine deriv. 13 | methyl N-(4-{6-[(2-methox...)
Affinity DataIC50: >1.00E+5nMT: 2°C. Assay description: Kinase activities were assayed in buffers containing substrate, enzyme, and inhibitor at 30 °C in the presence of 15 uM ATP/[gamma-32P] ATP. 32P...
In DepthDetails ArticlePubMed
TargetCyclin-dependent kinase 5 activator 1 [99-307](Homo sapiens (Human))
Institut Curie
LigandPNGBDBM10648(2-arylpurine deriv. 13 | methyl N-(4-{6-[(2-methox...)
Affinity DataIC50:  4.00E+3nMpH: 7.2 T: 2°C. Assay description: Kinase activities were assayed in buffers containing substrate, enzyme, and inhibitor at 30 °C in the presence of 15 uM ATP/[gamma-32P] ATP. 32P...
In DepthDetails ArticlePubMed