BDBM106958 US8592581, 9
SMILES CC[C@H](Nc1nc(NCc2ccncc2)c2ncn(C(C)C)c2n1)[C@@H](C)O
InChI Key InChIKey=AHNKZHOSFCUALJ-HIFRSBDPSA-N
Data  2 IC50
  Tab Delimited (TSV)   2D SDfile   Computed 3D by Vconf -m prep SDfile
Find this compound or compounds like it in BindingDB:
Activity Spreadsheet -- Enzyme Inhibition Constant Data from BindingDB
Found 2 hits for monomerid = 106958
TargetCyclin-dependent kinase 9(Homo sapiens (Human))
Cyclacel
US Patent
LigandPNGBDBM106958(US8592581, 9)
Affinity DataIC50:  610nMpH: 7.5 T: 2°C. Assay description: To evaluate the in-vitro kinase potency of the compounds, they were screened against CDK 2 and CDK9. Kinase assays were performed in 96-well plates u...
In DepthDetails US Patent
TargetCyclin-dependent kinase 2(Homo sapiens (Human))
Cyclacel
US Patent
LigandPNGBDBM106958(US8592581, 9)
Affinity DataIC50:  40nMpH: 7.5 T: 2°C. Assay description: To evaluate the in-vitro kinase potency of the compounds, they were screened against CDK 2 and CDK9. Kinase assays were performed in 96-well plates u...
In DepthDetails US Patent