BDBM107506 US8598357, 9
SMILES O=C(N[C@H]1CC[C@H](CCN2CCC(CC2)c2cccc3OCOc23)CC1)c1ccccc1
InChI Key InChIKey=KTBHNUYISHHNFW-JKIUYZKVSA-N
Data  3 KI
  Tab Delimited (TSV)   2D SDfile   Computed 3D by Vconf -m prep SDfile
Find this compound or compounds like it in BindingDB:
Activity Spreadsheet -- Enzyme Inhibition Constant Data from BindingDB
Found 3 hits for monomerid = 107506
TargetD(3) dopamine receptor(Homo sapiens (Human))
Hoffmann-La Roche
US Patent
LigandPNGBDBM107506(US8598357, 9)
Affinity DataKi:  3.63nM. Assay description: The ability of the compounds to bind to the 5-HT2A, D3 and D2 receptors was determined using radioligand binding to cloned receptors selectively expr...
In DepthDetails US Patent
Target5-hydroxytryptamine receptor 2A(Homo sapiens (Human))
Hoffmann-La Roche
US Patent
LigandPNGBDBM107506(US8598357, 9)
Affinity DataKi:  5.14nM. Assay description: The ability of the compounds to bind to the 5-HT2A, D3 and D2 receptors was determined using radioligand binding to cloned receptors selectively expr...
In DepthDetails US Patent
TargetD(2) dopamine receptor(Homo sapiens (Human))
Hoffmann-La Roche
US Patent
LigandPNGBDBM107506(US8598357, 9)
Affinity DataKi:  120nM. Assay description: The ability of the compounds to bind to the 5-HT2A, D3 and D2 receptors was determined using radioligand binding to cloned receptors selectively expr...
In DepthDetails US Patent