BDBM108431 US8609688, 9
SMILES CN(C)C(=O)C1CCN(CC1)c1cccc(c1)-c1ccc2nc(-c3cccnc3N)n(-c3ccc(cc3)C3(N)CCC3)c2n1
InChI Key InChIKey=RDJQWBMPPFHDAB-UHFFFAOYSA-N
Data  2 IC50  2 Kd
  Tab Delimited (TSV)   2D SDfile   Computed 3D by Vconf -m prep SDfile
Find this compound or compounds like it in BindingDB:
Activity Spreadsheet -- Enzyme Inhibition Constant Data from BindingDB
Found 4 hits for monomerid = 108431
TargetRAC-alpha serine/threonine-protein kinase(Homo sapiens (Human))
Arqule
US Patent
LigandPNGBDBM108431(US8609688, 9)
Affinity DataKd:  0.200nMpH: 7.5 T: 2°C. Assay description: Protein-ligand binding was identified with the thermal shift assay which is based on the ligand-induced stabilization of the protein tertiary structu...
In DepthDetails US Patent
TargetRAC-alpha serine/threonine-protein kinase(Homo sapiens (Human))
Arqule
US Patent
LigandPNGBDBM108431(US8609688, 9)
Affinity DataIC50:  2.51nM. Assay description: AKT1 activity was assayed using the GSK3-derived biotinylated peptide substrate, crosstide (biotin-GRPRTSSFAEG), and AlphaScreen (Amplified Luminesce...
In DepthDetails US Patent
TargetRAC-alpha serine/threonine-protein kinase(Homo sapiens (Human))
Arqule
US Patent
LigandPNGBDBM108431(US8609688, 9)
Affinity DataKd:  0.200nM. Assay description: Binding analysis. Protein-ligand binding was identified with the thermal shift assay which is based on the ligand-induced stabilization of the protei...
In DepthDetails US Patent
TargetRAC-alpha serine/threonine-protein kinase(Homo sapiens (Human))
Arqule
US Patent
LigandPNGBDBM108431(US8609688, 9)
Affinity DataIC50:  2.51nMpH: 8.0 T: 2°C. Assay description: AKT1 activity was assayed using the GSK3-derived biotinylated peptide substrate, crosstide (biotin-GRPRTSSFAEG), and AlphaScreen™ (Amplified Lum...
In DepthDetails US Patent