BDBM108452 US8604016, 9::US9938267, Cmpd ID 9
SMILES CC(CCc1nnc(NC(=O)Cc2ccccc2)s1)CCc1nnc(NC(=O)Cc2ccccc2)s1
InChI Key InChIKey=HNQSDKYDWZZOBV-UHFFFAOYSA-N
Data  2 IC50
  Tab Delimited (TSV)   2D SDfile   Computed 3D by Vconf -m prep SDfile
Find this compound or compounds like it in BindingDB:
Activity Spreadsheet -- Enzyme Inhibition Constant Data from BindingDB
Found 2 hits for monomerid = 108452
TargetGlutaminase kidney isoform, mitochondrial(Homo sapiens (Human))
Calithera Biosciences
US Patent
LigandPNGBDBM108452(US8604016, 9 | US9938267, Cmpd ID 9)
Affinity DataIC50: >5.00E+4nM. Assay description: No preinc (Column 4).
In DepthDetails US Patent
TargetGlutaminase kidney isoform, mitochondrial(Homo sapiens (Human))
Calithera Biosciences
US Patent
LigandPNGBDBM108452(US8604016, 9 | US9938267, Cmpd ID 9)
Affinity DataIC50: >5.00E+4nM. Assay description: Compounds were assessed for their ability to inhibit the enzymatic activity of a recombinant form of Glutaminase 1 (GAC) using a biochemical assay th...
In DepthDetails US Patent