BDBM110173 Ethyl 4-[3-(2-fluorobenzoyl)thioureido]benzoate (1j)
SMILES CCOC(=O)c1ccc(NC(=S)NC(=O)c2ccccc2F)cc1
InChI Key InChIKey=WQOZSRHMVMMUQH-UHFFFAOYSA-N
Data  1 IC50
  Tab Delimited (TSV)   2D SDfile   Computed 3D by Vconf -m prep SDfile
Find this compound or compounds like it in BindingDB:
Activity Spreadsheet -- Enzyme Inhibition Constant Data from BindingDB
Found 1 hit for monomerid = 110173
TargetUrease [D459Y,K653P](Canavalia ensiformis (Jack bean))
Quaid-I-Azam University, Islamabad, Pakistan.
LigandPNGBDBM110173(Ethyl 4-[3-(2-fluorobenzoyl)thioureido]benzoate (1...)
Affinity DataIC50:  730nMpH: 8.2 T: 2°C. Assay description: The assay mixture contained 40 µL of buffer (0.01 M LiCl2, 1 mM EDTA, 0.01M K2HPO4, pH 8.2) containing 100 mM urea, 10 µL of enzyme (5U/mL)...
In DepthDetails ArticlePubMed