BDBM113066 US8633208, 9
SMILES Cc1cn(cn1)-c1ccc2nc(ncc2c1)-c1ccc2OCOc2c1
InChI Key InChIKey=NNWOFHUCMPLQPA-UHFFFAOYSA-N
Data  2 IC50
  Tab Delimited (TSV)   2D SDfile   Computed 3D by Vconf -m prep SDfile
Find this compound or compounds like it in BindingDB:
Activity Spreadsheet -- Enzyme Inhibition Constant Data from BindingDB
Found 2 hits for monomerid = 113066
TargetAmine oxidase [flavin-containing] B(Homo sapiens (Human))
Rottapharm
US Patent
LigandPNGBDBM113066(US8633208, 9)
Affinity DataIC50:  1.00E+4nM. Assay description: Inhibitory activity of compounds was evaluated by a homogeneous luminescent method, the MAO-Glo Assay (Promega), measuring the monoamine oxidase acti...
In DepthDetails US Patent
TargetAmine oxidase [flavin-containing] A(Homo sapiens (Human))
Rottapharm
US Patent
LigandPNGBDBM113066(US8633208, 9)
Affinity DataIC50:  1.00E+4nM. Assay description: Inhibitory activity of compounds was evaluated by a homogeneous luminescent method, the MAO-Glo Assay (Promega), measuring the monoamine oxidase acti...
In DepthDetails US Patent