BDBM11314 1,8-dihydroxy-4-nitro-9H-xanthen-9-one::1,8-dihydroxy-4-nitro-xanthen-9-one::MNX
SMILES Oc1cccc2oc3c(ccc(O)c3c(=O)c12)[N+]([O-])=O
InChI Key InChIKey=ZOHCDJRFYXKEQW-UHFFFAOYSA-N
Data  2 KI
PDB links: 1 PDB ID matches this monomer.
  Tab Delimited (TSV)   2D SDfile   Computed 3D by Vconf -m prep SDfile
Find this compound or compounds like it in BindingDB:
Activity Spreadsheet -- Enzyme Inhibition Constant Data from BindingDB
Found 2 hits for monomerid = 11314
TargetCasein kinase II subunit alpha(Homo sapiens (Human))
China Pharmaceutical University
Curated by ChEMBL
LigandPNGBDBM11314(1,8-dihydroxy-4-nitro-9H-xanthen-9-one | 1,8-dihyd...)
Affinity DataKi:  780nM. Assay description: Inhibition of CK2alpha (unknown origin)
In DepthDetails ArticlePubMed
TargetCasein kinase II subunit alpha(Zea mays (Maize))
University Of Padova
LigandPNGBDBM11314(1,8-dihydroxy-4-nitro-9H-xanthen-9-one | 1,8-dihyd...)
Affinity DataKi:  800nM ΔG°:  -8.23kcal/molepH: 7.5 T: 2°C. Assay description: In vitro kinase assay using purified enzyme, was incubated at room temperature with substrate, and test compounds in the presence of 100 uM ATP/ [gam...