BDBM114069 MLS000681540::SMR000269209::[4-[2-(3-ethoxyphenoxy)ethoxy]phenyl]-phenyl-methanone::[4-[2-(3-ethoxyphenoxy)ethoxy]phenyl]-phenylmethanone::cid_2283081::{4-[2-(3-ethoxyphenoxy)ethoxy]phenyl}(phenyl)methanone
SMILES CCOc1cccc(OCCOc2ccc(cc2)C(=O)c2ccccc2)c1
InChI Key InChIKey=FBHIVHNFNSLKBD-UHFFFAOYSA-N
Data  2 IC50
  Tab Delimited (TSV)   2D SDfile   Computed 3D by Vconf -m prep SDfile
Find this compound or compounds like it in BindingDB:
Activity Spreadsheet -- Enzyme Inhibition Constant Data from BindingDB
Found 2 hits for monomerid = 114069
TargetDisintegrin and metalloproteinase domain-containing protein 17(Homo sapiens (Human))
The Scripps Research Institute Molecular Screening Center
Curated by PubChem BioAssay
LigandPNGBDBM114069(MLS000681540 | SMR000269209 | [4-[2-(3-ethoxypheno...)
Affinity DataIC50:  6.95E+4nM. Assay description: Source (MLPCN Center Name): The Scripps Research Institute Molecular Screening Center (SRIMSC) Center Affiliation: Torrey Pines Institute for Molecul...
In DepthDetails PCBioAssay
TargetDisintegrin and metalloproteinase domain-containing protein 10(Homo sapiens (Human))
The Scripps Research Institute Molecular Screening Center
Curated by PubChem BioAssay
LigandPNGBDBM114069(MLS000681540 | SMR000269209 | [4-[2-(3-ethoxypheno...)
Affinity DataIC50:  6.95E+4nM. Assay description: Source (MLPCN Center Name): The Scripps Research Institute Molecular Screening Center (SRIMSC) Center Affiliation: Torrey Pines Institute for Molecul...
In DepthDetails PCBioAssay