BDBM11447 4-{[5-(cyclohexylmethoxy)-[1,2,4]triazolo[1,5-a]pyrimidin-7-yl]amino}benzene-1-sulfonamide::triazolo[1,5-a]pyrimidine 5
SMILES NS(=O)(=O)c1ccc(Nc2cc(OCC3CCCCC3)nc3ncnn23)cc1
InChI Key InChIKey=NMAZGYDYIYLSLJ-UHFFFAOYSA-N
Data  2 IC50
PDB links: 1 PDB ID matches this monomer.
  Tab Delimited (TSV)   2D SDfile   Computed 3D by Vconf -m prep SDfile
Find this compound or compounds like it in BindingDB:
Activity Spreadsheet -- Enzyme Inhibition Constant Data from BindingDB
Found 2 hits for monomerid = 11447
TargetGlycogen synthase kinase-3 beta(Rattus norvegicus (rat))
Vernalis (R&D)
LigandPNGBDBM11447(4-{[5-(cyclohexylmethoxy)-[1,2,4]triazolo[1,5-a]py...)
Affinity DataIC50:  2.90E+4nMpH: 7.5 T: 2°C. Assay description: In vitro kinase assay using purified GSK-3 beta was incubated at room temperature with substrate, and test compounds in the presence of 10 uM ATP/ [g...
In DepthDetails ArticlePubMed
TargetCyclin-A2/Cyclin-dependent kinase 2(Homo sapiens (Human))
Vernalis (R&D)
LigandPNGBDBM11447(4-{[5-(cyclohexylmethoxy)-[1,2,4]triazolo[1,5-a]py...)
Affinity DataIC50:  1.10E+4nMpH: 7.5 T: 2°C. Assay description: In vitro kinase assay using purified CDK enzyme was incubated at room temperature with substrate, and test compounds in the presence of 100 uM ATP/ [...