BDBM114986 1-phenyl-2-(2-phenylethylsulfanyl)imidazole::1-phenyl-2-(2-phenylethylthio)imidazole::2-(phenethylsulfanyl)-1-phenyl-1H-imidazole::2-(phenethylthio)-1-phenyl-imidazole::MLS000327196::SMR000179805::cid_1477534
SMILES C(Cc1ccccc1)Sc1nccn1-c1ccccc1
InChI Key InChIKey=VARJAHYAMWUYFI-UHFFFAOYSA-N
Data  1 EC50
  Tab Delimited (TSV)   2D SDfile   Computed 3D by Vconf -m prep SDfile
Find this compound or compounds like it in BindingDB:
Activity Spreadsheet -- Enzyme Inhibition Constant Data from BindingDB
Found 1 hit for monomerid = 114986
TargetOxysterols receptor LXR-beta(Homo sapiens (Human))
The Scripps Research Institute Molecular Screening Center
Curated by PubChem BioAssay
LigandPNGBDBM114986(1-phenyl-2-(2-phenylethylsulfanyl)imidazole | 1-ph...)
Affinity DataEC50:  6.76E+4nM. Assay description: Source (MLPCN Center Name): The Scripps Research Institute Molecular Screening Center Affiliation: UT Southwestern Assay Provider: David Mangelsdorf,...
In DepthDetails PCBioAssay