BDBM115177 (−)-Ethyl 2-[2-(2-benzoyl-5,6-dibromo-1H-benzo[d]imidazol-1-yl)pentanamido]acetate (Compound 23)::(+)-Ethyl 2-[2-(2-benzoyl-5,6-dibromo-1H-benzo[d]imidazol-1-yl)pentanamido] acetate (Compound 22)
SMILES CCCC(C(=O)NCC(=O)OCC)n1c(nc2cc(Br)c(Br)cc12)C(=O)c1ccccc1
InChI Key InChIKey=BDRQGNFAASWALX-UHFFFAOYSA-N
Data  2 IC50
  Tab Delimited (TSV)   2D SDfile   Computed 3D by Vconf -m prep SDfile
Find this compound or compounds like it in BindingDB:
Activity Spreadsheet -- Enzyme Inhibition Constant Data from BindingDB
Found 2 hits for monomerid = 115177
TargetKinesin-like protein KIF11 [1-973](Homo sapiens (Human))
University Of Santiago De Compostela
LigandPNGBDBM115177((−)-Ethyl 2-[2-(2-benzoyl-5,6-dibromo-1H-ben...)
Affinity DataIC50:  1.72E+3nM. Assay description: The IC50 measurements were done using a microtubule-activated ATPase kinetic assay according to the manufacturer's instructions. Reactions were ...
In DepthDetails ArticlePubMed
TargetKinesin-like protein KIF11 [1-973](Homo sapiens (Human))
University Of Santiago De Compostela
LigandPNGBDBM115177((−)-Ethyl 2-[2-(2-benzoyl-5,6-dibromo-1H-ben...)
Affinity DataIC50:  1.37E+3nM. Assay description: The IC50 measurements were done using a microtubule-activated ATPase kinetic assay according to the manufacturer's instructions. Reactions were ...
In DepthDetails ArticlePubMed