BDBM119450 US8686018, 109
SMILES Cn1nc(C(F)F)c(C(=O)NC2(CC2)c2ccc(cc2)C(O)=O)c1Oc1cccc(c1)C(F)(F)F
InChI Key InChIKey=YZYUFGCMJDMLRO-UHFFFAOYSA-N
Data  1 KI
  Tab Delimited (TSV)   2D SDfile   Computed 3D by Vconf -m prep SDfile
Find this compound or compounds like it in BindingDB:
Activity Spreadsheet -- Enzyme Inhibition Constant Data from BindingDB
Found 1 hit for monomerid = 119450
TargetProstaglandin E2 receptor EP4 subtype(Homo sapiens (Human))
Eisai R&D Management
US Patent
LigandPNGBDBM119450(US8686018, 109)
Affinity DataKi:  8nMpH: 7.4Assay Description:The radioligand EP4 binding assay was performed using ChemiScreen recombinant human EP4 receptor membrane preparations from Millipore, according to m...
In DepthDetails US Patent