BDBM120806 US8716482, 9
SMILES C[C@H](F)CN1C[C@@H](C[C@H](N)C1c1cc(F)ccc1F)N1Cc2cn(nc2C1)S(C)(=O)=O
InChI Key InChIKey=LIIMYVTXVXBLAV-CSHKYZJLSA-N
Data  1 IC50
  Tab Delimited (TSV)   2D SDfile   Computed 3D by Vconf -m prep SDfile
Find this compound or compounds like it in BindingDB:
Activity Spreadsheet -- Enzyme Inhibition Constant Data from BindingDB
Found 1 hit for monomerid = 120806
TargetDipeptidyl peptidase 4(Homo sapiens (Human))
Merck Sharp & Dohme
US Patent
LigandPNGBDBM120806(US8716482, 9)
Affinity DataIC50:  0.400nMpH: 7.5Assay Description:A continuous fluorometric assay is employed with the substrate Gly-Pro-AMC, which is cleaved by DPP-4 to release the fluorescent AMC leaving group. T...
In DepthDetails US Patent