BDBM120838 N-benzoyl-5-(-3'-nitrophenyl)-3-phenylpyrazoline (2i)
SMILES [O-][N+](=O)c1cccc(c1)C1CC(=NN1C(=O)c1ccccc1)c1ccccc1
InChI Key InChIKey=BXXUGJYCEIAZGL-UHFFFAOYSA-N
Data  2 KI
  Tab Delimited (TSV)   2D SDfile   Computed 3D by Vconf -m prep SDfile
Find this compound or compounds like it in BindingDB:
Activity Spreadsheet -- Enzyme Inhibition Constant Data from BindingDB
Found 2 hits for monomerid = 120838
TargetCathepsin B(Capra hircus (Goat))
Kurukshetra University
LigandPNGBDBM120838(N-benzoyl-5-(-3'-nitrophenyl)-3-phenylpyrazoli...)
Affinity DataKi:  1.95nM ΔG°:  -12.4kcal/molepH: 6.0 T: 2°C. Assay description: Enzyme was equilibrated in 0.1 M phosphate buffer, pH 6.0 at 37 °C. All compounds were prepared in DMSO. Various concentrations of compounds we...
In DepthDetails ArticlePubMed
TargetCathepsin H(Capra hircus (Goat))
Kurukshetra University
LigandPNGBDBM120838(N-benzoyl-5-(-3'-nitrophenyl)-3-phenylpyrazoli...)
Affinity DataKi:  9.80nM ΔG°:  -11.4kcal/molepH: 6.0 T: 2°C. Assay description: Enzyme was equilibrated in 0.1 M phosphate buffer, pH 6.0 at 37 °C. All compounds were prepared in DMSO. Various concentrations of compounds we...
In DepthDetails ArticlePubMed