BDBM123845 US8748608, 19
SMILES COc1ccccc1N1CCN(CC(O)CCNC(=O)c2ccc-3c(Cc4ccccc-34)c2)CC1
InChI Key InChIKey=TUZMIWVHPWQEBK-UHFFFAOYSA-N
Data  1 KI  1 IC50
  Tab Delimited (TSV)   2D SDfile   Computed 3D by Vconf -m prep SDfile
Find this compound or compounds like it in BindingDB:
Activity Spreadsheet -- Enzyme Inhibition Constant Data from BindingDB
Found 1 hit for monomerid = 123845
TargetD(3) dopamine receptor(Homo sapiens (Human))
The United States of America As Represented By The Secretary of The Department of Health and Human Services
US Patent
LigandPNGBDBM123845(US8748608, 19)
Affinity DataKi:  1.80nM IC50:  3.90nM. Assay description: Methods for performing in vitro dopamine receptor binding studies are described in Huang et al. J. Med. Chem. 44:1815-1826 (2001) and Luedtke et al. ...
In DepthDetails US Patent