BDBM127729 US10251889, Example 102::US10758542, Example 102::US8791123, 102::US9782415, Example 102::US9796724, Example 102
SMILES CC1(CCC1)NC(=O)c1cnn2ccc(nc12)N1CCCC1c1cncc(F)c1
InChI Key InChIKey=YGJUUAYGTMKZBM-UHFFFAOYSA-N
Data  10 IC50
  Tab Delimited (TSV)   2D SDfile   Computed 3D by Vconf -m prep SDfile
Find this compound or compounds like it in BindingDB:
Activity Spreadsheet -- Enzyme Inhibition Constant Data from BindingDB
Found 10 hits for monomerid = 127729
TargetHigh affinity nerve growth factor receptor(Homo sapiens (Human))
Array Biopharma
US Patent
LigandPNGBDBM127729(US10251889, Example 102 | US10758542, Example 102 ...)
Affinity DataIC50:  5.20nMpH: 7.5Assay Description:An enzyme-linked immunosorbant assay (ELISA) was used to assess TrkA kinase activity in the presence of inhibitors. Immulon 4HBX 384-well microtiter ...
In DepthDetails US Patent
TargetTyrosine-protein kinase JAK2(Homo sapiens (Human))
Array Biopharma
US Patent
LigandPNGBDBM127729(US10251889, Example 102 | US10758542, Example 102 ...)
Affinity DataIC50: >1.00E+3nM. Assay description: Compounds of Formula I were screened for their ability to inhibit Jak2 using the general enzyme inhibition assay method, in which the assay mixture c...
In DepthDetails US Patent
TargetHigh affinity nerve growth factor receptor(Homo sapiens (Human))
Array Biopharma
US Patent
LigandPNGBDBM127729(US10251889, Example 102 | US10758542, Example 102 ...)
Affinity DataIC50:  5.20nM. Assay description: An enzyme-linked immunosorbant assay (ELISA) was used to assess TrkA kinase activity in the presence of inhibitors. Immulon 4HBX 384-well microtiter ...
In DepthDetails US Patent
TargetTyrosine-protein kinase JAK2(Homo sapiens (Human))
Array Biopharma
US Patent
LigandPNGBDBM127729(US10251889, Example 102 | US10758542, Example 102 ...)
Affinity DataIC50: >1.00E+3nM. Assay description: Compounds of Formula I were screened for their ability to inhibit Jak2 using the general enzyme inhibition assay method, in which the assay mixture c...
In DepthDetails US Patent
TargetTyrosine-protein kinase JAK2 [808-1132](Homo sapiens (Human))
Array Biopharma
US Patent
LigandPNGBDBM127729(US10251889, Example 102 | US10758542, Example 102 ...)
Affinity DataIC50: >1.00E+3nM. Assay description: Jak2: Compounds of Formula I were screened for their ability to inhibit Jak2 using the general enzyme inhibition assay method, in which the assay mix...
In DepthDetails US Patent
TargetHigh affinity nerve growth factor receptor(Homo sapiens (Human))
Array Biopharma
US Patent
LigandPNGBDBM127729(US10251889, Example 102 | US10758542, Example 102 ...)
Affinity DataIC50: >1.00E+3nM. Assay description: An enzyme-linked immunosorbant assay (ELISA) was used to assess TrkA kinase activity in the presence of inhibitors. Immulon 4HBX 384-well microtiter ...
In DepthDetails US Patent
TargetHigh affinity nerve growth factor receptor(Homo sapiens (Human))
Array Biopharma
US Patent
LigandPNGBDBM127729(US10251889, Example 102 | US10758542, Example 102 ...)
Affinity DataIC50:  5.20nM. Assay description: Trk enzymatic selectivity was assessed using Omnia™ Kinase Assay reagents from Invitrogen Corp. Enzyme (either TrkA or TrkB from Invitrogen Corp.) an...
In DepthDetails US Patent
TargetTyrosine-protein kinase JAK2 [808-1132](Homo sapiens (Human))
Array Biopharma
US Patent
LigandPNGBDBM127729(US10251889, Example 102 | US10758542, Example 102 ...)
Affinity DataIC50: >1.00E+3nM. Assay description: Compounds of Formula I were screened for their ability to inhibit Jak2 using the general enzyme inhibition assay method, in which the assay mixture c...
In DepthDetails US Patent
TargetHigh affinity nerve growth factor receptor(Homo sapiens (Human))
Array Biopharma
US Patent
LigandPNGBDBM127729(US10251889, Example 102 | US10758542, Example 102 ...)
Affinity DataIC50:  5.20nM. Assay description: An enzyme-linked immunosorbant assay (ELISA) was used to assess TrkA kinase activity in the presence of inhibitors. Immulon 4HBX 384-well microtiter ...
In DepthDetails US Patent
TargetTyrosine-protein kinase JAK2(Homo sapiens (Human))
Array Biopharma
US Patent
LigandPNGBDBM127729(US10251889, Example 102 | US10758542, Example 102 ...)
Affinity DataIC50:  5.20nM. Assay description: Compounds of Formula I were screened for their ability to inhibit Jak2 using the general enzyme inhibition assay method, in which the assay mixture c...
In DepthDetails US Patent