BDBM129728 US8815926, 7
SMILES COc1ncc(-c2nc3C(=O)N(C(c3n2C(C)C)c2ccc(Cl)cc2C)c2cc(Cl)ccc2C)c(OC)n1
InChI Key InChIKey=XBJHBEQDHSREQB-UHFFFAOYSA-N
Data  3 IC50
PDB links: 1 PDB ID matches this monomer.
  Tab Delimited (TSV)   2D SDfile   Computed 3D by Vconf -m prep SDfile
Find this compound or compounds like it in BindingDB:
Activity Spreadsheet -- Enzyme Inhibition Constant Data from BindingDB
Found 3 hits for monomerid = 129728
TargetE3 ubiquitin-protein ligase Mdm2(Homo sapiens (Human))
Novartis
US Patent
LigandPNGBDBM129728(US8815926, 7)
Affinity DataIC50:  0.170nM. Assay description: The inhibition of p53-MDM2 and p53-MDM4 interactions is measured by time resolved fluorescence energy transfer (TR-FRET). Fluorescence energy transfe...
TargetE3 ubiquitin-protein ligase Mdm2(Homo sapiens (Human))
Novartis
US Patent
LigandPNGBDBM129728(US8815926, 7)
Affinity DataIC50:  0.160nM. Assay description: Inhibition of Cy5-labeled p53 derived TFSDLWKLL peptide binding to C-terminal biotin-labelled human MDM2 (2 to 188 residues) by TR-FRET assay
TargetProtein Mdm4(Homo sapiens (Human))
Novartis
US Patent
LigandPNGBDBM129728(US8815926, 7)
Affinity DataIC50:  530nM. Assay description: The inhibition of p53-MDM2 and p53-MDM4 interactions is measured by time resolved fluorescence energy transfer (TR-FRET). Fluorescence energy transfe...
In DepthDetails US Patent