BDBM13072 0134-36::1-methyl-3-oxo-1,3-dihydro-2,1-benzothiazole-5-sulfonamide::LeadQuest Compound 6
SMILES Cn1sc(=O)c2cc(ccc12)S(N)(=O)=O
InChI Key InChIKey=DFPYCCVFXMWMJM-UHFFFAOYSA-N
Data  1 IC50
PDB links: 1 PDB ID matches this monomer.
  Tab Delimited (TSV)   2D SDfile   Computed 3D by Vconf -m prep SDfile
Find this compound or compounds like it in BindingDB:
Activity Spreadsheet -- Enzyme Inhibition Constant Data from BindingDB
Found 1 hit for monomerid = 13072
TargetCarbonic anhydrase 2(Homo sapiens (Human))
University Of Marburg
LigandPNGBDBM13072(0134-36 | 1-methyl-3-oxo-1,3-dihydro-2,1-benzothia...)
Affinity DataIC50:  246nMpH: 7.4 T: 2°C. Assay description: Initial rates of 4-nitrophenyl acetate hydrolysis catalyzed by different CA isozymes were monitored spectrophotometrically at 400 nm. A molar absorpt...