BDBM135925 US8859586, 9
SMILES COc1cc2CC(=O)N(C3CCC(CC3)N(C)C(=O)CCO)C(c3ccc(Cl)cc3)c2cc1OC(C)C
InChI Key InChIKey=WVFCXNDELQILBB-UHFFFAOYSA-N
Data  2 IC50
  Tab Delimited (TSV)   2D SDfile   Computed 3D by Vconf -m prep SDfile
Find this compound or compounds like it in BindingDB:
Activity Spreadsheet -- Enzyme Inhibition Constant Data from BindingDB
Found 2 hits for monomerid = 135925
TargetProtein Mdm4(Homo sapiens (Human))
Novartis
US Patent
LigandPNGBDBM135925(US8859586, 9)
Affinity DataIC50:  9.21E+4nM. Assay description: The inhibition of p53-MDM2 and p53-MDM4 interactions is measured by time resolved fluorescence energy transfer (TR-FRET). Fluorescence energy transfe...
In DepthDetails US Patent
TargetE3 ubiquitin-protein ligase Mdm2(Homo sapiens (Human))
Novartis
US Patent
LigandPNGBDBM135925(US8859586, 9)
Affinity DataIC50:  406nM. Assay description: The inhibition of p53-MDM2 and p53-MDM4 interactions is measured by time resolved fluorescence energy transfer (TR-FRET). Fluorescence energy transfe...
In DepthDetails US Patent