BDBM136919 US10231967, Example 10::US8865911, 9::US9918985, Example 9
SMILES COc1cccc(c1F)-c1ccc2OCCC3(N=C(C)C(N)=N3)c2c1
InChI Key InChIKey=HZUBJQJZQJTUIS-UHFFFAOYSA-N
Data  5 IC50
  Tab Delimited (TSV)   2D SDfile   Computed 3D by Vconf -m prep SDfile
Find this compound or compounds like it in BindingDB:
Activity Spreadsheet -- Enzyme Inhibition Constant Data from BindingDB
Found 5 hits for monomerid = 136919
TargetBeta-secretase 1(Homo sapiens (Human))
Astrazeneca
US Patent
LigandPNGBDBM136919(US10231967, Example 10 | US8865911, 9 | US9918985,...)
Affinity DataIC50:  1.68E+3nMpH: 9.2Assay Description:The beta-secretase enzyme used in the TR-FRET is prepared as follows: The cDNA for the soluble part of the human beta-Secretase (AA 1-AA 460) was clo...
In DepthDetails US Patent
TargetAmyloid-beta precursor protein(Homo sapiens (Human))
Astrazeneca
US Patent
LigandPNGBDBM136919(US10231967, Example 10 | US8865911, 9 | US9918985,...)
Affinity DataIC50:  1.68E+3nM. Assay description: The β-secretase enzyme used in the TR-FRET is prepared as follows: The cDNA for the soluble part of the human β-Secretase (AA 1-AA 460) was...
In DepthDetails US Patent
TargetBeta-secretase 1 [1-460](Homo sapiens (Human))
Astrazeneca
US Patent
LigandPNGBDBM136919(US10231967, Example 10 | US8865911, 9 | US9918985,...)
Affinity DataIC50:  1.68E+3nM. Assay description: The enzyme (truncated form) was diluted to 6 μg/mL (stock 1.3 mg/mL) and the substrate (Europium)CEVNLDAEFK(Qsy7) to 200 nM (stock 120 μM) ...
In DepthDetails US Patent
TargetAmyloid-beta precursor protein(Homo sapiens (Human))
Astrazeneca
US Patent
LigandPNGBDBM136919(US10231967, Example 10 | US8865911, 9 | US9918985,...)
Affinity DataIC50:  6.85E+3nM. Assay description: The β-secretase enzyme used in the TR-FRET is prepared as follows: The cDNA for the soluble part of the human β-Secretase (AA 1-AA 460) was...
In DepthDetails US Patent
TargetAmyloid-beta precursor protein(Homo sapiens (Human))
Astrazeneca
US Patent
LigandPNGBDBM136919(US10231967, Example 10 | US8865911, 9 | US9918985,...)
Affinity DataIC50:  2.45E+3nM. Assay description: SH-SY5Y cells were cultured in DMEM/F-12 with Glutamax, 10% FCS and 1% non-essential amino acids and cryopreserved and stored at −140° C. at a ...
In DepthDetails US Patent