BDBM13879 3-amidinobenzylindole carboxamide 64::methyl 3-[({1-[(3-carbamimidoylphenyl)methyl]-4-hydroxy-1H-indol-2-yl}formamido)methyl]benzoate
SMILES COC(=O)c1cccc(CNC(=O)c2cc3c(O)cccc3n2Cc2cccc(c2)C(N)=N)c1
InChI Key InChIKey=CMQOCVCCCMZPAD-UHFFFAOYSA-N
Data  1 KI
  Tab Delimited (TSV)   2D SDfile   Computed 3D by Vconf -m prep SDfile
Find this compound or compounds like it in BindingDB:
Activity Spreadsheet -- Enzyme Inhibition Constant Data from BindingDB
Found 1 hit for monomerid = 13879
TargetCoagulation factor X(Homo sapiens (Human))
Aventis Pharma Deutschland
LigandPNGBDBM13879(3-amidinobenzylindole carboxamide 64 | methyl 3-[(...)
Affinity DataKi:  2.04E+3nM. Assay description: The inhibitory effect of test compound for human fXa was determined by using the chromogenic substrates S-2765. The hydrolysis rates of chromogenic s...
In DepthDetails ArticlePubMed