BDBM139063 US8883771, 9
SMILES CN[C@@H](C)C(=O)N[C@H]1CN(CC[C@H]2CCC(N2C1=O)C(=O)NC(c1ccccc1)c1ccccc1)S(=O)(=O)CCCCCCS(=O)(=O)N1CC[C@H]2CC[C@H](N2C(=O)[C@H](C1)NC(=O)[C@H](C)NC)C(=O)NC(c1ccccc1)c1ccccc1
InChI Key InChIKey=SJTAOGPAGKLGJU-VWEWNJDNSA-N
Data  3 IC50
  Tab Delimited (TSV)   2D SDfile   Computed 3D by Vconf -m prep SDfile
Find this compound or compounds like it in BindingDB:
Activity Spreadsheet -- Enzyme Inhibition Constant Data from BindingDB
Found 3 hits for monomerid = 139063
TargetE3 ubiquitin-protein ligase XIAP(Homo sapiens (Human))
The Regents Of The University Of Michigan
US Patent
LigandPNGBDBM139063(US8883771, 9)
Affinity DataIC50: <10nMpH: 7.5Assay Description:Binding affinities of the present compounds to XIAP linker-BIR2-BIR3 (residues 120-356), cIAP1-BIR3 (residues 253-363), and cIAP-2 BIR3 (residues 238...
In DepthDetails US Patent
TargetBaculoviral IAP repeat-containing protein 3(Homo sapiens (Human))
The Regents Of The University Of Michigan
US Patent
LigandPNGBDBM139063(US8883771, 9)
Affinity DataIC50: <100nMpH: 7.5Assay Description:Binding affinities of the present compounds to XIAP linker-BIR2-BIR3 (residues 120-356), cIAP1-BIR3 (residues 253-363), and cIAP-2 BIR3 (residues 238...
In DepthDetails US Patent
TargetBaculoviral IAP repeat-containing protein 2(Homo sapiens (Human))
The Regents Of The University Of Michigan
US Patent
LigandPNGBDBM139063(US8883771, 9)
Affinity DataIC50: <100nMpH: 7.5Assay Description:Binding affinities of the present compounds to XIAP linker-BIR2-BIR3 (residues 120-356), cIAP1-BIR3 (residues 253-363), and cIAP-2 BIR3 (residues 238...
In DepthDetails US Patent