BDBM139994 US8901140, 9::US9358227, 9
SMILES CCOc1cc2ncnc(Nc3ccc(F)c(Cl)c3)c2cc1NC(=O)\C=C\[C@H]1CCCN1C
InChI Key InChIKey=JZQOPZNZLUYLTR-MNDMWVCDSA-N
Data  3 IC50
  Tab Delimited (TSV)   2D SDfile   Computed 3D by Vconf -m prep SDfile
Find this compound or compounds like it in BindingDB:
Activity Spreadsheet -- Enzyme Inhibition Constant Data from BindingDB
Found 3 hits for monomerid = 139994
TargetEpidermal growth factor receptor(Homo sapiens (Human))
Jiangsu Hengrui Medicine
US Patent
LigandPNGBDBM139994(US8901140, 9 | US9358227, 9)
Affinity DataIC50:  2nM. Assay description: The following assay may be used to determine the activity of the compounds of the invention for inhibiting EGFR kinase activity. The half maximal inh...
In DepthDetails US Patent
TargetEpidermal growth factor receptor(Homo sapiens (Human))
Jiangsu Hengrui Medicine
US Patent
LigandPNGBDBM139994(US8901140, 9 | US9358227, 9)
Affinity DataIC50:  2nM. Assay description: The following assay may be used to determine the activity of the compounds of the invention for inhibiting EGFR kinase activity. The half maximal inh...
In DepthDetails US Patent
TargetEpidermal growth factor receptor(Homo sapiens (Human))
Jiangsu Hengrui Medicine
US Patent
LigandPNGBDBM139994(US8901140, 9 | US9358227, 9)
Affinity DataIC50:  8nM. Assay description: The following in vitro assay is to determine the activity of the tested compounds for inhibiting the proliferation of cancer cells, which has high ex...
In DepthDetails US Patent