BDBM140536 US8912221, 9
SMILES C[C@@H](NC(=O)C1(COC1)NC(=O)c1cc(C)no1)c1ncc(cc1F)-c1cc(Cl)cc(Cl)c1OCC(F)F
InChI Key InChIKey=FGAZQSUHSMGEAD-GFCCVEGCSA-N
Data  1 KI
  Tab Delimited (TSV)   2D SDfile   Computed 3D by Vconf -m prep SDfile
Find this compound or compounds like it in BindingDB:
Activity Spreadsheet -- Enzyme Inhibition Constant Data from BindingDB
Found 1 hit for monomerid = 140536
TargetB1 bradykinin receptor(Homo sapiens (Human))
Hoffmann-La Roche
US Patent
LigandPNGBDBM140536(US8912221, 9)
Affinity DataKi:  5.10nMpH: 7.4Assay Description:For binding, Bradykinin-1 receptor antagonist compounds were added in various concentrations in 50 mM Tris pH 7.4, 5 mM MgCl2 together with 6 nM Kall...
In DepthDetails US Patent