BDBM140580 US8912224, 9
SMILES Cc1cc(CNC(=O)c2cnc(Oc3ccc4OC(CCc4c3)c3ccccc3)s2)ccn1
InChI Key InChIKey=NWFOYYKKOKDTOM-UHFFFAOYSA-N
Data  1 IC50
  Tab Delimited (TSV)   2D SDfile   Computed 3D by Vconf -m prep SDfile
Find this compound or compounds like it in BindingDB:
Activity Spreadsheet -- Enzyme Inhibition Constant Data from BindingDB
Found 1 hit for monomerid = 140580
TargetSodium/calcium exchanger 1(Homo sapiens (Human))
Sanofi
US Patent
LigandPNGBDBM140580(US8912224, 9)
Affinity DataIC50:  800nM. Assay description: The assay is based on the monitoring of intracellular Ca2+concentrations using the calcium-sensitive dye Fluo-4. CHO cells expressing NCX1 were loade...
In DepthDetails US Patent