BDBM141909 US8921424, 9
SMILES CCN(CC)CCSc1ccc(\C=C\C(=O)NO)cc1N
InChI Key InChIKey=MDFHHPZAYBVIME-SOFGYWHQSA-N
Data  1 IC50
  Tab Delimited (TSV)   2D SDfile   Computed 3D by Vconf -m prep SDfile
Find this compound or compounds like it in BindingDB:
Activity Spreadsheet -- Enzyme Inhibition Constant Data from BindingDB
Found 1 hit for monomerid = 141909
TargetHistone deacetylase 6(Homo sapiens (Human))
Zhejiang Hisun Pharmaceutical
US Patent
LigandPNGBDBM141909(US8921424, 9)
Affinity DataIC50:  295nM. Assay description: The BIOMOL fluorescent-based HDAC activity assay has been applied in In vitro HDACi assay for determination of IC50 values of the compounds of this i...
In DepthDetails US Patent