BDBM142017 US8927539, 9
SMILES Cn1ccc(cc1=O)-c1ccc(cc1)C(C)(C)N1CCC(CC(C)(C)O)(OC1=O)c1ccccc1
InChI Key InChIKey=YRTTYWNJWAGBKQ-UHFFFAOYSA-N
Data  1 IC50
  Tab Delimited (TSV)   2D SDfile   Computed 3D by Vconf -m prep SDfile
Find this compound or compounds like it in BindingDB:
Activity Spreadsheet -- Enzyme Inhibition Constant Data from BindingDB
Found 1 hit for monomerid = 142017
Target11-beta-hydroxysteroid dehydrogenase 1(Homo sapiens (Human))
Vitae Pharmaceuticals
US Patent
LigandPNGBDBM142017(US8927539, 9)
Affinity DataIC50:  37nMpH: 7.4Assay Description:The inhibition of a microsomal preparation of 11beta -HSD1 by compounds of the invention was measured essentially as previously described (K. Solly, ...
In DepthDetails US Patent