BDBM14203 7-(3-methoxyphenyl)-N-[3-(4-methylpiperazin-1-yl)phenyl]-7H-pyrrolo[2,3-d]pyrimidin-2-amine::pyrrolopyrimidine 26
SMILES COc1cccc(c1)-n1ccc2cnc(Nc3cccc(c3)N3CCN(C)CC3)nc12
InChI Key InChIKey=NQJJXCBEOJRICB-UHFFFAOYSA-N
Data  1 IC50
  Tab Delimited (TSV)   2D SDfile   Computed 3D by Vconf -m prep SDfile
Find this compound or compounds like it in BindingDB:
Activity Spreadsheet -- Enzyme Inhibition Constant Data from BindingDB
Found 1 hit for monomerid = 14203
TargetAurora kinase A(Mus musculus (mouse))
Johnson & Johnson Pharmaceutical
LigandPNGBDBM14203(7-(3-methoxyphenyl)-N-[3-(4-methylpiperazin-1-yl)p...)
Affinity DataIC50:  6nMpH: 7.5 T: 2°C. Assay description: The compounds were tested for their ability to inhibit the phosphorylation of serine 10 of histone-H3 by purified recombinant murine Aurora-A enzyme....
In DepthDetails ArticlePubMed