BDBM142591 US8933224, 9
SMILES Cc1nc([C@@H]2CCOC2)c2c(ncnn12)N1CCc2nc(oc2C1)C1CC1
InChI Key InChIKey=CLIUTCNDBPIRQJ-CYBMUJFWSA-N
Data  2 IC50
  Tab Delimited (TSV)   2D SDfile   Computed 3D by Vconf -m prep SDfile
Find this compound or compounds like it in BindingDB:
Activity Spreadsheet -- Enzyme Inhibition Constant Data from BindingDB
Found 2 hits for monomerid = 142591
TargetcAMP and cAMP-inhibited cGMP 3',5'-cyclic phosphodiesterase 10A(Homo sapiens (Human))
Pfizer
US Patent
LigandPNGBDBM142591(US8933224, 9)
Affinity DataIC50:  1.14nMpH: 7.5Assay Description:The ability of a compound to inhibit PDE10 enzymatic activity can be demonstrated by any number of assays that are known in the art. The products of ...
In DepthDetails US Patent
TargetcAMP and cAMP-inhibited cGMP 3',5'-cyclic phosphodiesterase 10A(Rattus norvegicus (rat))
Pfizer
US Patent
LigandPNGBDBM142591(US8933224, 9)
Affinity DataIC50:  0.892nMpH: 7.5Assay Description:The ability of a compound to inhibit PDE10 enzymatic activity can be demonstrated by any number of assays that are known in the art. The products of ...
In DepthDetails US Patent