BDBM142707 US8937084, 9
SMILES COc1ccc(CN2CC[C@]34CCN(CC5CC5)[C@H](Cc5ccc(OC)cc35)[C@@H]4C2)cc1
InChI Key InChIKey=SVTZFJVYLKUGJJ-IARZGTGTSA-N
Data  1 KI
  Tab Delimited (TSV)   2D SDfile   Computed 3D by Vconf -m prep SDfile
Find this compound or compounds like it in BindingDB:
Activity Spreadsheet -- Enzyme Inhibition Constant Data from BindingDB
Found 1 hit for monomerid = 142707
TargetKappa-type opioid receptor(Homo sapiens (Human))
Purdue Pharma
US Patent
LigandPNGBDBM142707(US8937084, 9)
Affinity DataKi:  204nM ΔG°:  -9.88kcal/molepH: 7.4 T: 2°C. Assay description: Radioligand dose-displacement binding assays for u-opioid receptors used 0.3 nM [3H]-diprenorphine (Perkin Elmer, Shelton, Conn.), with 5 mg membrane...
In DepthDetails US Patent